Merge branch 'cleanup/trailing_whitespaces' into 'master'

removed all trailing whitespaces in all git files

Cleanup of all files, i.e. removed all white-spaces at the end of lines

See merge request !3
4 jobs for master in 119 minutes and 8 seconds (queued for 82 minutes and 21 seconds)
Status Job ID Name Coverage
  Build
failed #419
build:9-debug-gcc

01:05:24

failed #421
build:9-parallel-debug-gcc

00:56:30

failed #422
build:9-parallel-release-gcc

00:55:56

failed #420
build:9-release-gcc

01:06:31

 
Name Stage Failure
failed
build:9-parallel-release-gcc Build There is an unknown failure, please try again
       SerUtil::deserialize(in, revNumber);
^~
make[2]: *** [CMakeFiles/amdis.dir/src/parallel/MeshDistributor.cc.o] Error 1
CMakeFiles/amdis.dir/build.make:3062: recipe for target 'CMakeFiles/amdis.dir/src/parallel/MeshDistributor.cc.o' failed
CMakeFiles/Makefile2:142: recipe for target 'CMakeFiles/amdis.dir/all' failed
make[1]: *** [CMakeFiles/amdis.dir/all] Error 2
make: *** [all] Error 2
Makefile:127: recipe for target 'all' failed
ERROR: Build failed: exit code 1
failed
build:9-parallel-debug-gcc Build There is an unknown failure, please try again
         { if (Test) throw Exception; }
^~~~~~~~~
CMakeFiles/amdis.dir/build.make:3062: recipe for target 'CMakeFiles/amdis.dir/src/parallel/MeshDistributor.cc.o' failed
make[2]: *** [CMakeFiles/amdis.dir/src/parallel/MeshDistributor.cc.o] Error 1
make[1]: *** [CMakeFiles/amdis.dir/all] Error 2
CMakeFiles/Makefile2:142: recipe for target 'CMakeFiles/amdis.dir/all' failed
Makefile:127: recipe for target 'all' failed
make: *** [all] Error 2
ERROR: Build failed: exit code 1
failed
build:9-release-gcc Build There is an unknown failure, please try again
   template<typename> class auto_ptr;
^~~~~~~~
[100%] Linking CXX executable parametric
[100%] Built target parametric
CMake Error: The source directory "/builds/iwr/amdis/tools/test_suite" does not appear to contain CMakeLists.txt.
Specify --help for usage, or press the help button on the CMake GUI.
Error: could not load cache
Error: could not load cache
ERROR: Build failed: exit code 1
failed
build:9-debug-gcc Build There is an unknown failure, please try again
         { if (Test) throw Exception; }
^~~~~~~~~
[100%] Linking CXX executable parametric
[100%] Built target parametric
CMake Error: The source directory "/builds/iwr/amdis/tools/test_suite" does not appear to contain CMakeLists.txt.
Specify --help for usage, or press the help button on the CMake GUI.
Error: could not load cache
Error: could not load cache
ERROR: Build failed: exit code 1