gitlab ci script updated

4 jobs for develop in 24 minutes and 49 seconds (queued for 1 second)
Status Name Job ID Coverage
  Test
failed debian:10 clang-6-libcpp-17 #6354

00:14:31

passed debian:10 gcc-8-17 #6353

00:24:49

passed debian:9 gcc-6-14 #6355

00:19:23

failed ubuntu:18.04 clang-6-17 #6356

00:13:44

 
Name Stage Failure
failed
debian:10 clang-6-libcpp-17 Test
                      ^
7 warnings and 9 errors generated.
make[3]: *** [examples/CMakeFiles/ellipt.3d.dir/build.make:63: examples/CMakeFiles/ellipt.3d.dir/ellipt.cc.o] Error 1
make[2]: *** [CMakeFiles/Makefile2:2182: examples/CMakeFiles/ellipt.3d.dir/all] Error 2
make[1]: *** [CMakeFiles/Makefile2:2057: examples/CMakeFiles/examples.dir/rule] Error 2
make: *** [Makefile:873: examples] Error 2
--- Failed to build amdis ---
Terminating dunecontrol due to previous errors!
ERROR: Job failed: exit code 1
failed
ubuntu:18.04 clang-6-17 Test
make[2]: *** [examples/CMakeFiles/ellipt.3d.dir/all] Error 2
CMakeFiles/Makefile2:2176: recipe for target 'examples/CMakeFiles/ellipt.3d.dir/all' failed
make[1]: *** [examples/CMakeFiles/examples.dir/rule] Error 2
CMakeFiles/Makefile2:2051: recipe for target 'examples/CMakeFiles/examples.dir/rule' failed
Makefile:873: recipe for target 'examples' failed
make: *** [examples] Error 2
--- Failed to build amdis ---
Terminating dunecontrol due to previous errors!
ERROR: Job failed: exit code 1