Added fmt as output formatting library

4 jobs for develop in 12 minutes and 55 seconds (queued for 1 second)
Status Job ID Name Coverage
  Test
failed #6358
debian:10 clang-6-libcpp-17

00:12:55

failed #6357
debian:10 gcc-8-17

00:03:33

failed #6359
debian:9 gcc-6-14

00:03:38

failed #6360
ubuntu:18.04 clang-6-17

00:12:07

 
Name Stage Failure
failed
debian:10 clang-6-libcpp-17 Test
                      ^
7 warnings and 9 errors generated.
make[3]: *** [examples/CMakeFiles/ellipt.3d.dir/build.make:63: examples/CMakeFiles/ellipt.3d.dir/ellipt.cc.o] Error 1
make[2]: *** [CMakeFiles/Makefile2:2176: examples/CMakeFiles/ellipt.3d.dir/all] Error 2
make[1]: *** [CMakeFiles/Makefile2:2055: examples/CMakeFiles/examples.dir/rule] Error 2
make: *** [Makefile:873: examples] Error 2
--- Failed to build amdis ---
Terminating dunecontrol due to previous errors!
ERROR: Job failed: exit code 1
failed
ubuntu:18.04 clang-6-17 Test
CMakeFiles/Makefile2:2170: recipe for target 'examples/CMakeFiles/ellipt.3d.dir/all' failed
make[2]: *** [examples/CMakeFiles/ellipt.3d.dir/all] Error 2
CMakeFiles/Makefile2:2049: recipe for target 'examples/CMakeFiles/examples.dir/rule' failed
make[1]: *** [examples/CMakeFiles/examples.dir/rule] Error 2
Makefile:873: recipe for target 'examples' failed
make: *** [examples] Error 2
--- Failed to build amdis ---
Terminating dunecontrol due to previous errors!
ERROR: Job failed: exit code 1
failed
debian:9 gcc-6-14 Test
CMakeFiles/Makefile2:1548: recipe for target 'test/CMakeFiles/ExpressionsTest.dir/all' failed
make[2]: *** [test/CMakeFiles/ExpressionsTest.dir/all] Error 2
make[1]: *** [CMakeFiles/build_tests.dir/rule] Error 2
CMakeFiles/Makefile2:215: recipe for target 'CMakeFiles/build_tests.dir/rule' failed
Makefile:247: recipe for target 'build_tests' failed
make: *** [build_tests] Error 2
--- Failed to build amdis ---
Terminating dunecontrol due to previous errors!
ERROR: Job failed: exit code 1
failed
debian:10 gcc-8-17 Test
[ 65%] Linking CXX executable AdaptInfoTest
[ 65%] Built target AdaptInfoTest
[ 67%] Linking CXX executable FiniteElementTypeTest
[ 67%] Built target FiniteElementTypeTest
make[1]: *** [CMakeFiles/Makefile2:1053: CMakeFiles/build_tests.dir/rule] Error 2
make: *** [Makefile:587: build_tests] Error 2
--- Failed to build amdis ---
Terminating dunecontrol due to previous errors!
ERROR: Job failed: exit code 1