fmt library added differently

4 jobs for develop in 13 minutes and 10 seconds (queued for 1 second)
Status Name Job ID Coverage
  Test
failed debian:10 clang-6-libcpp-17 #6366

00:13:10

failed debian:10 gcc-8-17 #6365

00:04:02

failed debian:9 gcc-6-14 #6367

00:03:59

failed ubuntu:18.04 clang-6-17 #6368

00:12:28

 
Name Stage Failure
failed
ubuntu:18.04 clang-6-17 Test
CMakeFiles/Makefile2:2207: recipe for target 'examples/CMakeFiles/ellipt.3d.dir/all' failed
make[2]: *** [examples/CMakeFiles/ellipt.3d.dir/all] Error 2
make[1]: *** [examples/CMakeFiles/examples.dir/rule] Error 2
CMakeFiles/Makefile2:2086: recipe for target 'examples/CMakeFiles/examples.dir/rule' failed
make: *** [examples] Error 2
Makefile:886: recipe for target 'examples' failed
--- Failed to build amdis ---
Terminating dunecontrol due to previous errors!
ERROR: Job failed: exit code 1
failed
debian:9 gcc-6-14 Test
make[2]: *** [test/CMakeFiles/ExpressionsTest.dir/all] Error 2
CMakeFiles/Makefile2:1585: recipe for target 'test/CMakeFiles/ExpressionsTest.dir/all' failed
make[1]: *** [CMakeFiles/build_tests.dir/rule] Error 2
CMakeFiles/Makefile2:252: recipe for target 'CMakeFiles/build_tests.dir/rule' failed
Makefile:260: recipe for target 'build_tests' failed
make: *** [build_tests] Error 2
--- Failed to build amdis ---
Terminating dunecontrol due to previous errors!
ERROR: Job failed: exit code 1
failed
debian:10 clang-6-libcpp-17 Test
                      ^
6 warnings and 9 errors generated.
make[3]: *** [examples/CMakeFiles/ellipt.3d.dir/build.make:63: examples/CMakeFiles/ellipt.3d.dir/ellipt.cc.o] Error 1
make[2]: *** [CMakeFiles/Makefile2:2213: examples/CMakeFiles/ellipt.3d.dir/all] Error 2
make[1]: *** [CMakeFiles/Makefile2:2092: examples/CMakeFiles/examples.dir/rule] Error 2
make: *** [Makefile:886: examples] Error 2
--- Failed to build amdis ---
Terminating dunecontrol due to previous errors!
ERROR: Job failed: exit code 1
failed
debian:10 gcc-8-17 Test
make[2]: *** [CMakeFiles/Makefile2:1591: test/CMakeFiles/DOFVectorTest.dir/all] Error 2
[ 66%] Built target AdaptInfoTest
[ 68%] Linking CXX executable FiniteElementTypeTest
[ 68%] Built target FiniteElementTypeTest
make[1]: *** [CMakeFiles/Makefile2:1090: CMakeFiles/build_tests.dir/rule] Error 2
make: *** [Makefile:600: build_tests] Error 2
--- Failed to build amdis ---
Terminating dunecontrol due to previous errors!
ERROR: Job failed: exit code 1