moved field-mat-vec operations to namespace Dune

4 jobs for develop in 2 minutes and 35 seconds (queued for 4 seconds)
Status Job ID Name Coverage
  Test
failed #6378
debian:10 clang-6-libcpp-17

00:02:04

failed #6377
debian:10 gcc-8-17

00:02:16

failed #6379
debian:9 gcc-6-14

00:02:34

failed #6380
ubuntu:18.04 clang-6-17

00:02:03

 
Name Stage Failure
failed
ubuntu:18.04 clang-6-17 Test
CMakeFiles/Makefile2:1521: recipe for target 'test/CMakeFiles/FieldMatVecTest.dir/all' failed
make[2]: *** [test/CMakeFiles/FieldMatVecTest.dir/all] Error 2
make[1]: *** [CMakeFiles/build_tests.dir/rule] Error 2
CMakeFiles/Makefile2:1084: recipe for target 'CMakeFiles/build_tests.dir/rule' failed
Makefile:600: recipe for target 'build_tests' failed
make: *** [build_tests] Error 2
--- Failed to build amdis ---
Terminating dunecontrol due to previous errors!
ERROR: Job failed: exit code 1
failed
debian:9 gcc-6-14 Test
make[2]: *** [test/CMakeFiles/FieldMatVecTest.dir/all] Error 2
CMakeFiles/Makefile2:1617: recipe for target 'test/CMakeFiles/FieldMatVecTest.dir/all' failed
CMakeFiles/Makefile2:252: recipe for target 'CMakeFiles/build_tests.dir/rule' failed
make[1]: *** [CMakeFiles/build_tests.dir/rule] Error 2
Makefile:260: recipe for target 'build_tests' failed
make: *** [build_tests] Error 2
--- Failed to build amdis ---
Terminating dunecontrol due to previous errors!
ERROR: Job failed: exit code 1
failed
debian:10 clang-6-libcpp-17 Test
     ^
4 errors generated.
make[3]: *** [test/CMakeFiles/FieldMatVecTest.dir/build.make:63: test/CMakeFiles/FieldMatVecTest.dir/FieldMatVecTest.cpp.o] Error 1
make[2]: *** [CMakeFiles/Makefile2:1527: test/CMakeFiles/FieldMatVecTest.dir/all] Error 2
make[1]: *** [CMakeFiles/Makefile2:1090: CMakeFiles/build_tests.dir/rule] Error 2
make: *** [Makefile:600: build_tests] Error 2
--- Failed to build amdis ---
Terminating dunecontrol due to previous errors!
ERROR: Job failed: exit code 1
failed
debian:10 gcc-8-17 Test
 auto p_norm(FieldMatrix<T, 1, N> const& x)
^~~~~~
make[3]: *** [test/CMakeFiles/FieldMatVecTest.dir/build.make:63: test/CMakeFiles/FieldMatVecTest.dir/FieldMatVecTest.cpp.o] Error 1
make[2]: *** [CMakeFiles/Makefile2:1527: test/CMakeFiles/FieldMatVecTest.dir/all] Error 2
make[1]: *** [CMakeFiles/Makefile2:1090: CMakeFiles/build_tests.dir/rule] Error 2
make: *** [Makefile:600: build_tests] Error 2
--- Failed to build amdis ---
Terminating dunecontrol due to previous errors!
ERROR: Job failed: exit code 1