removed usage of hierarchic vector wrapper where not necessary

4 jobs for issue/remove_hierarchic_wrapper in 10 minutes and 38 seconds (queued for 2 seconds)
Status Job ID Name Coverage
  Test
failed #6404
debian:10 clang-6-libcpp-17

00:04:47

failed #6403
debian:10 gcc-8-17

00:03:22

passed #6405
debian:9 gcc-6-14

00:10:37

failed #6406
ubuntu:18.04 clang-6-17

00:04:41

 
Name Stage Failure
failed
debian:10 clang-6-libcpp-17 Test
[ 73%] Linking CXX executable FiniteElementTypeTest
[ 73%] Built target FiniteElementTypeTest
[ 75%] Linking CXX executable ExpressionsTest
[ 75%] Built target ExpressionsTest
make[1]: *** [CMakeFiles/Makefile2:1090: CMakeFiles/build_tests.dir/rule] Error 2
make: *** [Makefile:600: build_tests] Error 2
--- Failed to build amdis ---
Terminating dunecontrol due to previous errors!
ERROR: Job failed: exit code 1
failed
ubuntu:18.04 clang-6-17 Test
[ 75%] Linking CXX executable ExpressionsTest
[ 75%] Built target ExpressionsTest
CMakeFiles/Makefile2:1084: recipe for target 'CMakeFiles/build_tests.dir/rule' failed
make[1]: *** [CMakeFiles/build_tests.dir/rule] Error 2
Makefile:600: recipe for target 'build_tests' failed
make: *** [build_tests] Error 2
--- Failed to build amdis ---
Terminating dunecontrol due to previous errors!
ERROR: Job failed: exit code 1
failed
debian:10 gcc-8-17 Test
                         ^~~~
vec4
make[3]: *** [test/CMakeFiles/DOFVectorTest.dir/build.make:63: test/CMakeFiles/DOFVectorTest.dir/DOFVectorTest.cpp.o] Error 1
make[2]: *** [CMakeFiles/Makefile2:1591: test/CMakeFiles/DOFVectorTest.dir/all] Error 2
make[1]: *** [CMakeFiles/Makefile2:1090: CMakeFiles/build_tests.dir/rule] Error 2
make: *** [Makefile:600: build_tests] Error 2
--- Failed to build amdis ---
Terminating dunecontrol due to previous errors!
ERROR: Job failed: exit code 1