Merge branch 'issue/grid_functions_order' into 'develop'

determine order of divides grid-function of second argument is constant

See merge request !69
4 jobs for develop in 29 minutes and 52 seconds (queued for 3 minutes and 57 seconds)
Status Job ID Name Coverage
  Test
passed #7953
debian:10 clang-6-libcpp-17

00:28:05

failed #7952
debian:10 gcc-8-17

00:02:26

failed #7954
debian:9 gcc-6-14

00:05:45

failed #7955
ubuntu:18.04 clang-6-17

00:03:14

 
Name Stage Failure
failed
ubuntu:18.04 clang-6-17 Test
[ 59%] Linking CXX executable DiscreteFunctionTest
[ 59%] Built target DiscreteFunctionTest
CMakeFiles/Makefile2:1056: recipe for target 'CMakeFiles/build_tests.dir/rule' failed
make[1]: *** [CMakeFiles/build_tests.dir/rule] Error 2
Makefile:587: recipe for target 'build_tests' failed
make: *** [build_tests] Error 2
--- Failed to build amdis ---
Terminating dunecontrol due to previous errors!
ERROR: Job failed: exit code 1
failed
debian:9 gcc-6-14 Test
CMakeFiles/Makefile2:2019: recipe for target 'test/CMakeFiles/OperatorsTest.dir/all' failed
make[2]: *** [test/CMakeFiles/OperatorsTest.dir/all] Error 2
make[1]: *** [CMakeFiles/build_tests.dir/rule] Error 2
CMakeFiles/Makefile2:1024: recipe for target 'CMakeFiles/build_tests.dir/rule' failed
Makefile:572: recipe for target 'build_tests' failed
make: *** [build_tests] Error 2
--- Failed to build amdis ---
Terminating dunecontrol due to previous errors!
ERROR: Job failed: exit code 1
failed
debian:10 gcc-8-17 Test
       static_assert(N == SIZE, "Sizes have to match for assignment!");
~~^~~~~~~
make[3]: *** [test/CMakeFiles/OperatorsTest.dir/build.make:63: test/CMakeFiles/OperatorsTest.dir/OperatorsTest.cpp.o] Error 1
make[2]: *** [CMakeFiles/Makefile2:2153: test/CMakeFiles/OperatorsTest.dir/all] Error 2
make[1]: *** [CMakeFiles/Makefile2:1062: CMakeFiles/build_tests.dir/rule] Error 2
make: *** [Makefile:587: build_tests] Error 2
--- Failed to build amdis ---
Terminating dunecontrol due to previous errors!
ERROR: Job failed: exit code 1