changed compiler feature detection name to AMDIS_HAS_CXX_FOLD_EXPRESSIONS

4 jobs for issue/fold_expressions in 19 minutes and 14 seconds (queued for 84 minutes and 41 seconds)
Status Job ID Name Coverage
  Test
failed #8287
debian:10 clang-6-libcpp-17

00:05:44

failed #8286
debian:10 gcc-8-17

00:06:30

failed #8288
debian:9 gcc-6-14

00:04:08

failed #8289
ubuntu:18.04 clang-6-17

00:08:28

 
Name Stage Failure
failed
ubuntu:18.04 clang-6-17 Test
CMakeFiles/Makefile2:2650: recipe for target 'examples/CMakeFiles/heat.2d.dir/all' failed
make[2]: *** [examples/CMakeFiles/heat.2d.dir/all] Error 2
make[1]: *** [examples/CMakeFiles/examples.dir/rule] Error 2
CMakeFiles/Makefile2:2337: recipe for target 'examples/CMakeFiles/examples.dir/rule' failed
Makefile:964: recipe for target 'examples' failed
make: *** [examples] Error 2
--- Failed to build amdis ---
Terminating dunecontrol due to previous errors!
ERROR: Job failed: exit code 1
failed
debian:10 clang-6-libcpp-17 Test
[ 40%] Built target TreeDataTest
2 errors generated.
make[3]: *** [test/CMakeFiles/OperatorsTest.dir/build.make:63: test/CMakeFiles/OperatorsTest.dir/OperatorsTest.cpp.o] Error 1
make[2]: *** [CMakeFiles/Makefile2:2121: test/CMakeFiles/OperatorsTest.dir/all] Error 2
make[1]: *** [CMakeFiles/Makefile2:1094: CMakeFiles/build_tests.dir/rule] Error 2
make: *** [Makefile:600: build_tests] Error 2
--- Failed to build amdis ---
Terminating dunecontrol due to previous errors!
ERROR: Job failed: exit code 1
failed
debian:9 gcc-6-14 Test
CMakeFiles/Makefile2:1635: recipe for target 'test/CMakeFiles/IntegrateTest.dir/all' failed
make[2]: *** [test/CMakeFiles/IntegrateTest.dir/all] Error 2
CMakeFiles/Makefile2:1024: recipe for target 'CMakeFiles/build_tests.dir/rule' failed
make[1]: *** [CMakeFiles/build_tests.dir/rule] Error 2
Makefile:572: recipe for target 'build_tests' failed
make: *** [build_tests] Error 2
--- Failed to build amdis ---
Terminating dunecontrol due to previous errors!
ERROR: Job failed: exit code 1
failed
debian:10 gcc-8-17 Test
       return (result = max(result, ts), ...);
~~~~~~~^~~~~~~~~~~~~~~~~
make[3]: *** [test/CMakeFiles/OperatorsTest.dir/build.make:63: test/CMakeFiles/OperatorsTest.dir/OperatorsTest.cpp.o] Error 1
make[2]: *** [CMakeFiles/Makefile2:2153: test/CMakeFiles/OperatorsTest.dir/all] Error 2
make[1]: *** [CMakeFiles/Makefile2:1062: CMakeFiles/build_tests.dir/rule] Error 2
make: *** [Makefile:587: build_tests] Error 2
--- Failed to build amdis ---
Terminating dunecontrol due to previous errors!
ERROR: Job failed: exit code 1