rebase to develop branch

4 jobs for feature/macros in 2 minutes and 19 seconds (queued for 41 seconds)
Status Job ID Name Coverage
  Test
failed #8569
debian:10 clang-6-libcpp-17

00:01:16

failed #8568
debian:10 gcc-8-17

00:01:08

failed #8570
debian:9 gcc-6-14

00:00:54

failed #8571
ubuntu:18.04 clang-6-17

00:01:33

 
Name Stage Failure
failed
ubuntu:18.04 clang-6-17 Test
make[2]: *** [CMakeFiles/amdis.dir/all] Error 2
CMakeFiles/Makefile2:1241: recipe for target 'CMakeFiles/amdis.dir/all' failed
CMakeFiles/Makefile2:2337: recipe for target 'examples/CMakeFiles/examples.dir/rule' failed
make[1]: *** [examples/CMakeFiles/examples.dir/rule] Error 2
Makefile:964: recipe for target 'examples' failed
make: *** [examples] Error 2
--- Failed to build amdis ---
Terminating dunecontrol due to previous errors!
ERROR: Job failed: exit code 1
failed
debian:10 clang-6-libcpp-17 Test
template <class _Tp> using remove_cv_t = typename remove_cv<_Tp>::type;
^
1 error generated.
make[2]: *** [CMakeFiles/amdis.dir/build.make:115: CMakeFiles/amdis.dir/src/amdis/AMDiS.cpp.o] Error 1
make[1]: *** [CMakeFiles/Makefile2:1215: CMakeFiles/amdis.dir/all] Error 2
make: *** [Makefile:163: all] Error 2
--- Failed to build amdis ---
Terminating dunecontrol due to previous errors!
ERROR: Job failed: exit code 1
failed
debian:9 gcc-6-14 Test
make[2]: *** [CMakeFiles/amdis.dir/src/amdis/AdaptInfo.cpp.o] Error 1
CMakeFiles/amdis.dir/build.make:86: recipe for target 'CMakeFiles/amdis.dir/src/amdis/AdaptInfo.cpp.o' failed
CMakeFiles/Makefile2:547: recipe for target 'CMakeFiles/amdis.dir/all' failed
make[1]: *** [CMakeFiles/amdis.dir/all] Error 2
make: *** [all] Error 2
Makefile:160: recipe for target 'all' failed
--- Failed to build amdis ---
Terminating dunecontrol due to previous errors!
ERROR: Job failed: exit code 1
failed
debian:10 gcc-8-17 Test
/builds/spraetor/dune-amdis/src/amdis/common/TypeTraits.hpp:62:17: error: parse error in template argument list
return std::make_unique<remove_cvref_t<Obj>>(FWD(obj));
^~~~~~~~~~~~~~~~~~~~~~~~~~~~~~
make[2]: *** [CMakeFiles/amdis.dir/build.make:76: CMakeFiles/amdis.dir/src/amdis/AdaptInfo.cpp.o] Error 1
make[1]: *** [CMakeFiles/Makefile2:1247: CMakeFiles/amdis.dir/all] Error 2
make: *** [Makefile:163: all] Error 2
--- Failed to build amdis ---
Terminating dunecontrol due to previous errors!
ERROR: Job failed: exit code 1