added remove_cvref_t type-traits

4 jobs for feature/macros in 1 minute and 45 seconds (queued for 2 seconds)
Status Job ID Name Coverage
  Test
failed #8573
debian:10 clang-6-libcpp-17

00:01:29

failed #8572
debian:10 gcc-8-17

00:01:29

failed #8574
debian:9 gcc-6-14

00:01:14

failed #8575
ubuntu:18.04 clang-6-17

00:01:44

 
Name Stage Failure
failed
ubuntu:18.04 clang-6-17 Test
make[2]: *** [CMakeFiles/amdis.dir/all] Error 2
CMakeFiles/Makefile2:1241: recipe for target 'CMakeFiles/amdis.dir/all' failed
CMakeFiles/Makefile2:2337: recipe for target 'examples/CMakeFiles/examples.dir/rule' failed
make[1]: *** [examples/CMakeFiles/examples.dir/rule] Error 2
Makefile:964: recipe for target 'examples' failed
make: *** [examples] Error 2
--- Failed to build amdis ---
Terminating dunecontrol due to previous errors!
ERROR: Job failed: exit code 1
failed
debian:10 clang-6-libcpp-17 Test
[ 70%] Building CXX object CMakeFiles/amdis.dir/src/amdis/common/String.cpp.o
1 warning and 1 error generated.
make[2]: *** [CMakeFiles/amdis.dir/build.make:167: CMakeFiles/amdis.dir/src/amdis/ProblemStat.cpp.o] Error 1
make[2]: *** Waiting for unfinished jobs....
make[1]: *** [CMakeFiles/Makefile2:1215: CMakeFiles/amdis.dir/all] Error 2
make: *** [Makefile:163: all] Error 2
--- Failed to build amdis ---
Terminating dunecontrol due to previous errors!
ERROR: Job failed: exit code 1
failed
debian:10 gcc-8-17 Test
   return mat;
^~~
at
make[2]: *** [CMakeFiles/amdis.dir/build.make:167: CMakeFiles/amdis.dir/src/amdis/ProblemStat.cpp.o] Error 1
make[1]: *** [CMakeFiles/Makefile2:1247: CMakeFiles/amdis.dir/all] Error 2
make: *** [Makefile:163: all] Error 2
--- Failed to build amdis ---
Terminating dunecontrol due to previous errors!
ERROR: Job failed: exit code 1
failed
debian:9 gcc-6-14 Test
make[2]: *** [CMakeFiles/amdis.dir/src/amdis/ProblemStat.cpp.o] Error 1
CMakeFiles/amdis.dir/build.make:254: recipe for target 'CMakeFiles/amdis.dir/src/amdis/ProblemStat.cpp.o' failed
make[1]: *** [CMakeFiles/amdis.dir/all] Error 2
CMakeFiles/Makefile2:547: recipe for target 'CMakeFiles/amdis.dir/all' failed
Makefile:160: recipe for target 'all' failed
make: *** [all] Error 2
--- Failed to build amdis ---
Terminating dunecontrol due to previous errors!
ERROR: Job failed: exit code 1