ConstantExpr with reference_wrapper argument, LocalAssembler accepts operator by reference_wrapper

1 job for develop in 1 minute and 31 seconds (queued for 7 seconds)
Status Job ID Name Coverage
  Test
failed #4840
dune:git--gcc

00:01:31

 
Name Stage Failure
failed
dune:git--gcc Test There is an unknown failure, please try again
dune/amdis/CMakeFiles/duneamdis.dir/build.make:230: recipe for target 'dune/amdis/CMakeFiles/duneamdis.dir/ProblemStat.cpp.o' failed
make[2]: *** [dune/amdis/CMakeFiles/duneamdis.dir/ProblemStat.cpp.o] Error 1
CMakeFiles/Makefile2:1473: recipe for target 'dune/amdis/CMakeFiles/duneamdis.dir/all' failed
make[1]: *** [dune/amdis/CMakeFiles/duneamdis.dir/all] Error 2
make: *** [all] Error 2
Makefile:160: recipe for target 'all' failed
--- Failed to build dune-amdis ---
Terminating dunecontrol due to previous errors!
ERROR: Job failed: exit code 1