Intel compiler compatibility

1 job for develop in 2 minutes and 6 seconds
Status Job ID Name Coverage
  Test
failed #4949
dune:git--gcc

00:02:06

 
Name Stage Failure
failed
dune:git--gcc Test There is an unknown failure, please try again
CMakeFiles/amdis.dir/build.make:254: recipe for target 'CMakeFiles/amdis.dir/dune/amdis/ProblemStat.cpp.o' failed
make[2]: *** [CMakeFiles/amdis.dir/dune/amdis/ProblemStat.cpp.o] Error 1
CMakeFiles/Makefile2:451: recipe for target 'CMakeFiles/amdis.dir/all' failed
make[1]: *** [CMakeFiles/amdis.dir/all] Error 2
Makefile:160: recipe for target 'all' failed
make: *** [all] Error 2
--- Failed to build dune-amdis ---
Terminating dunecontrol due to previous errors!
ERROR: Job failed: exit code 1