CI configuration updated

6 jobs for master in 5 minutes and 8 seconds (queued for 4 seconds)
Status Job ID Name Coverage
  Test
failed #7827
debian:10 clang-7-libcpp-17

00:02:02

passed #7826
debian:10 gcc-8-noassert-17

00:02:35

failed #7829
debian:9 clang-3.8-14

00:01:59

failed #7828
debian:9 gcc-6-14

00:01:33

failed #7830
ubuntu:16.04 gcc-5-14

00:01:17

passed #7831
ubuntu:18.04 clang-6-17

00:02:30

 
Name Stage Failure
failed
ubuntu:16.04 gcc-5-14 Test
CMakeFiles/Makefile2:1349: recipe for target 'dune/common/test/CMakeFiles/charconvtest.dir/all' failed
make[2]: *** [dune/common/test/CMakeFiles/charconvtest.dir/all] Error 2
make[1]: *** [CMakeFiles/build_tests.dir/rule] Error 2
CMakeFiles/Makefile2:202: recipe for target 'CMakeFiles/build_tests.dir/rule' failed
Makefile:247: recipe for target 'build_tests' failed
make: *** [build_tests] Error 2
--- Failed to build dune-common-extensions ---
Terminating dunecontrol due to previous errors!
ERROR: Job failed: exit code 1
failed
debian:9 clang-3.8-14 Test
CMakeFiles/Makefile2:1349: recipe for target 'dune/common/test/CMakeFiles/charconvtest.dir/all' failed
make[2]: *** [dune/common/test/CMakeFiles/charconvtest.dir/all] Error 2
CMakeFiles/Makefile2:202: recipe for target 'CMakeFiles/build_tests.dir/rule' failed
make[1]: *** [CMakeFiles/build_tests.dir/rule] Error 2
Makefile:247: recipe for target 'build_tests' failed
make: *** [build_tests] Error 2
--- Failed to build dune-common-extensions ---
Terminating dunecontrol due to previous errors!
ERROR: Job failed: exit code 1
failed
debian:9 gcc-6-14 Test
make[2]: *** [dune/common/test/CMakeFiles/charconvtest.dir/all] Error 2
CMakeFiles/Makefile2:1349: recipe for target 'dune/common/test/CMakeFiles/charconvtest.dir/all' failed
make[1]: *** [CMakeFiles/build_tests.dir/rule] Error 2
CMakeFiles/Makefile2:202: recipe for target 'CMakeFiles/build_tests.dir/rule' failed
Makefile:247: recipe for target 'build_tests' failed
make: *** [build_tests] Error 2
--- Failed to build dune-common-extensions ---
Terminating dunecontrol due to previous errors!
ERROR: Job failed: exit code 1
failed
debian:10 clang-7-libcpp-17 Test
             ^
2 errors generated.
make[3]: *** [dune/common/test/CMakeFiles/charconvtest.dir/build.make:63: dune/common/test/CMakeFiles/charconvtest.dir/charconvtest.cc.o] Error 1
make[2]: *** [CMakeFiles/Makefile2:1355: dune/common/test/CMakeFiles/charconvtest.dir/all] Error 2
make[1]: *** [CMakeFiles/Makefile2:1008: CMakeFiles/build_tests.dir/rule] Error 2
make: *** [Makefile:574: build_tests] Error 2
--- Failed to build dune-common-extensions ---
Terminating dunecontrol due to previous errors!
ERROR: Job failed: exit code 1