added implementation for quadmath, concurrentcache and strtonumber

6 jobs for master in 4 minutes and 24 seconds (queued for 2 seconds)
Status Job ID Name Coverage
  Test
failed #7845
debian:10 clang-7-libcpp-17

00:02:00

passed #7844
debian:10 gcc-8-noassert-17

00:02:35

passed #7847
debian:9 clang-3.8-14

00:02:04

passed #7846
debian:9 gcc-6-14

00:01:38

passed #7848
ubuntu:16.04 gcc-5-14

00:01:23

passed #7849
ubuntu:18.04 clang-6-17

00:02:20

 
Name Stage Failure
failed
debian:10 clang-7-libcpp-17 Test
make[3]: *** [dune/common/test/CMakeFiles/charconvtest.dir/build.make:63: dune/common/test/CMakeFiles/charconvtest.dir/charconvtest.cc.o] Error 1
make[2]: *** [CMakeFiles/Makefile2:1393: dune/common/test/CMakeFiles/charconvtest.dir/all] Error 2
[ 75%] Linking CXX executable concurrentcachetest
[ 75%] Built target concurrentcachetest
make[1]: *** [CMakeFiles/Makefile2:1011: CMakeFiles/build_tests.dir/rule] Error 2
make: *** [Makefile:574: build_tests] Error 2
--- Failed to build dune-common-extensions ---
Terminating dunecontrol due to previous errors!
ERROR: Job failed: exit code 1