solved some more compiler problems

6 jobs for feature/interpolation in 29 minutes and 46 seconds (queued for 7 seconds)
Status Job ID Name Coverage
  Test
failed #7451
debian:10 clang-6-libcpp-17

00:16:24

failed #7450
debian:10 gcc-8-noassert-17

00:17:59

failed #7453
debian:9 clang-3.8-14

00:14:21

failed #7452
debian:9 gcc-6-14

00:12:23

failed #7454
ubuntu:16.04 gcc-5-14

00:10:29

failed #7455
ubuntu:18.04 clang-6-17

00:15:18

 
Name Stage Failure
failed
ubuntu:18.04 clang-6-17 Test
1 warning generated.
[ 27%] Built target hierarchiciterator
[ 33%] Linking CXX executable multigridview
[ 33%] Built target multigridview
Makefile:162: recipe for target 'all' failed
make: *** [all] Error 2
--- Failed to build dune-multimesh ---
Terminating dunecontrol due to previous errors!
ERROR: Job failed: exit code 1
failed
ubuntu:16.04 gcc-5-14 Test
src/CMakeFiles/taylorhood.dir/build.make:62: recipe for target 'src/CMakeFiles/taylorhood.dir/taylorhood.cc.o' failed
make[2]: *** [src/CMakeFiles/taylorhood.dir/taylorhood.cc.o] Error 1
CMakeFiles/Makefile2:1251: recipe for target 'src/CMakeFiles/taylorhood.dir/all' failed
make[1]: *** [src/CMakeFiles/taylorhood.dir/all] Error 2
Makefile:160: recipe for target 'all' failed
make: *** [all] Error 2
--- Failed to build dune-multimesh ---
Terminating dunecontrol due to previous errors!
ERROR: Job failed: exit code 1
failed
debian:10 gcc-8-noassert-17 Test
make[1]: *** [CMakeFiles/Makefile2:1336: src/CMakeFiles/benchmark.dir/all] Error 2
[ 27%] Linking CXX executable hierarchiciterator
[ 27%] Built target hierarchiciterator
[ 33%] Linking CXX executable multigridview
[ 33%] Built target multigridview
make: *** [Makefile:163: all] Error 2
--- Failed to build dune-multimesh ---
Terminating dunecontrol due to previous errors!
ERROR: Job failed: exit code 1
failed
debian:10 clang-6-libcpp-17 Test
  ^
fatal error: too many errors emitted, stopping now [-ferror-limit=]
9 warnings and 20 errors generated.
make[2]: *** [src/CMakeFiles/benchmark.dir/build.make:63: src/CMakeFiles/benchmark.dir/benchmark.cc.o] Error 1
make[1]: *** [CMakeFiles/Makefile2:1336: src/CMakeFiles/benchmark.dir/all] Error 2
make: *** [Makefile:163: all] Error 2
--- Failed to build dune-multimesh ---
Terminating dunecontrol due to previous errors!
ERROR: Job failed: exit code 1
failed
debian:9 clang-3.8-14 Test
src/CMakeFiles/benchmark.dir/build.make:62: recipe for target 'src/CMakeFiles/benchmark.dir/benchmark.cc.o' failed
make[2]: *** [src/CMakeFiles/benchmark.dir/benchmark.cc.o] Error 1
make[1]: *** [src/CMakeFiles/benchmark.dir/all] Error 2
CMakeFiles/Makefile2:1251: recipe for target 'src/CMakeFiles/benchmark.dir/all' failed
Makefile:160: recipe for target 'all' failed
make: *** [all] Error 2
--- Failed to build dune-multimesh ---
Terminating dunecontrol due to previous errors!
ERROR: Job failed: exit code 1
failed
debian:9 gcc-6-14 Test
src/CMakeFiles/benchmark.dir/build.make:62: recipe for target 'src/CMakeFiles/benchmark.dir/benchmark.cc.o' failed
CMakeFiles/Makefile2:1251: recipe for target 'src/CMakeFiles/benchmark.dir/all' failed
make[2]: *** [src/CMakeFiles/benchmark.dir/benchmark.cc.o] Error 1
make[1]: *** [src/CMakeFiles/benchmark.dir/all] Error 2
Makefile:160: recipe for target 'all' failed
make: *** [all] Error 2
--- Failed to build dune-multimesh ---
Terminating dunecontrol due to previous errors!
ERROR: Job failed: exit code 1