Update .gitlab-ci.yml

6 jobs for feature/interpolation in 11 minutes and 57 seconds (queued for 5 seconds)
Status Job ID Name Coverage
  Test
failed #7409
debian:10 clang-6-libcpp-17

00:06:52

failed #7408
debian:10 gcc-8-noassert-17

00:07:21

failed #7411
debian:9 clang-3.8-14

00:05:42

failed #7410
debian:9 gcc-6-14

00:05:03

failed #7412
ubuntu:16.04 gcc-5-14

00:04:26

failed #7413
ubuntu:18.04 clang-6-17

00:06:11

 
Name Stage Failure
failed
ubuntu:18.04 clang-6-17 Test
  ^
1 warning generated.
[ 38%] Linking CXX executable testiterator
[ 38%] Built target testiterator
make: *** [all] Error 2
Makefile:162: recipe for target 'all' failed
--- Failed to build dune-multimesh ---
Terminating dunecontrol due to previous errors!
ERROR: Job failed: exit code 1
failed
ubuntu:16.04 gcc-5-14 Test
src/CMakeFiles/testiterator.dir/build.make:62: recipe for target 'src/CMakeFiles/testiterator.dir/testiterator.cc.o' failed
make[2]: *** [src/CMakeFiles/testiterator.dir/testiterator.cc.o] Error 1
CMakeFiles/Makefile2:1293: recipe for target 'src/CMakeFiles/testiterator.dir/all' failed
make[1]: *** [src/CMakeFiles/testiterator.dir/all] Error 2
Makefile:160: recipe for target 'all' failed
make: *** [all] Error 2
--- Failed to build dune-multimesh ---
Terminating dunecontrol due to previous errors!
ERROR: Job failed: exit code 1
failed
debian:10 gcc-8-noassert-17 Test
[ 33%] Linking CXX executable multigridview
[ 33%] Built target uggrid
[ 33%] Built target multigridview
[ 38%] Linking CXX executable testiterator
[ 38%] Built target testiterator
make: *** [Makefile:163: all] Error 2
--- Failed to build dune-multimesh ---
Terminating dunecontrol due to previous errors!
ERROR: Job failed: exit code 1
failed
debian:10 clang-6-libcpp-17 Test
  printGrid(grid);
^
1 warning and 2 errors generated.
make[2]: *** [src/CMakeFiles/testiterator.dir/build.make:63: src/CMakeFiles/testiterator.dir/testiterator.cc.o] Error 1
make[1]: *** [CMakeFiles/Makefile2:1373: src/CMakeFiles/testiterator.dir/all] Error 2
make: *** [Makefile:163: all] Error 2
--- Failed to build dune-multimesh ---
Terminating dunecontrol due to previous errors!
ERROR: Job failed: exit code 1
failed
debian:9 clang-3.8-14 Test
make[2]: *** [src/CMakeFiles/testiterator.dir/testiterator.cc.o] Error 1
src/CMakeFiles/testiterator.dir/build.make:62: recipe for target 'src/CMakeFiles/testiterator.dir/testiterator.cc.o' failed
make[1]: *** [src/CMakeFiles/testiterator.dir/all] Error 2
CMakeFiles/Makefile2:1330: recipe for target 'src/CMakeFiles/testiterator.dir/all' failed
make: *** [all] Error 2
Makefile:160: recipe for target 'all' failed
--- Failed to build dune-multimesh ---
Terminating dunecontrol due to previous errors!
ERROR: Job failed: exit code 1
failed
debian:9 gcc-6-14 Test
make[2]: *** [src/CMakeFiles/testiterator.dir/testiterator.cc.o] Error 1
src/CMakeFiles/testiterator.dir/build.make:62: recipe for target 'src/CMakeFiles/testiterator.dir/testiterator.cc.o' failed
CMakeFiles/Makefile2:1330: recipe for target 'src/CMakeFiles/testiterator.dir/all' failed
Makefile:160: recipe for target 'all' failed
make[1]: *** [src/CMakeFiles/testiterator.dir/all] Error 2
make: *** [all] Error 2
--- Failed to build dune-multimesh ---
Terminating dunecontrol due to previous errors!
ERROR: Job failed: exit code 1