corrected pipline errors

6 jobs for feature/interpolation in 29 minutes and 33 seconds (queued for 4 seconds)
Status Job ID Name Coverage
  Test
failed #7445
debian:10 clang-6-libcpp-17

00:16:25

failed #7444
debian:10 gcc-8-noassert-17

00:17:48

failed #7447
debian:9 clang-3.8-14

00:14:01

failed #7446
debian:9 gcc-6-14

00:11:57

failed #7448
ubuntu:16.04 gcc-5-14

00:10:23

failed #7449
ubuntu:18.04 clang-6-17

00:15:15

 
Name Stage Failure
failed
ubuntu:18.04 clang-6-17 Test
[ 38%] Built target hierarchiciterator
1 warning generated.
[ 44%] Linking CXX executable multigridview
[ 44%] Built target multigridview
Makefile:162: recipe for target 'all' failed
make: *** [all] Error 2
--- Failed to build dune-multimesh ---
Terminating dunecontrol due to previous errors!
ERROR: Job failed: exit code 1
failed
ubuntu:16.04 gcc-5-14 Test
src/CMakeFiles/taylorhood.dir/build.make:62: recipe for target 'src/CMakeFiles/taylorhood.dir/taylorhood.cc.o' failed
make[2]: *** [src/CMakeFiles/taylorhood.dir/taylorhood.cc.o] Error 1
make[1]: *** [src/CMakeFiles/taylorhood.dir/all] Error 2
CMakeFiles/Makefile2:1252: recipe for target 'src/CMakeFiles/taylorhood.dir/all' failed
make: *** [all] Error 2
Makefile:160: recipe for target 'all' failed
--- Failed to build dune-multimesh ---
Terminating dunecontrol due to previous errors!
ERROR: Job failed: exit code 1
failed
debian:10 gcc-8-noassert-17 Test
make[1]: *** [CMakeFiles/Makefile2:1410: src/CMakeFiles/localrefinement.dir/all] Error 2
[ 38%] Linking CXX executable hierarchiciterator
[ 44%] Linking CXX executable multigridview
[ 44%] Built target hierarchiciterator
[ 44%] Built target multigridview
make: *** [Makefile:163: all] Error 2
--- Failed to build dune-multimesh ---
Terminating dunecontrol due to previous errors!
ERROR: Job failed: exit code 1
failed
debian:10 clang-6-libcpp-17 Test
  ^
fatal error: too many errors emitted, stopping now [-ferror-limit=]
22 warnings and 20 errors generated.
make[2]: *** [src/CMakeFiles/benchmark.dir/build.make:63: src/CMakeFiles/benchmark.dir/benchmark.cc.o] Error 1
make[1]: *** [CMakeFiles/Makefile2:1336: src/CMakeFiles/benchmark.dir/all] Error 2
make: *** [Makefile:163: all] Error 2
--- Failed to build dune-multimesh ---
Terminating dunecontrol due to previous errors!
ERROR: Job failed: exit code 1
failed
debian:9 clang-3.8-14 Test
src/CMakeFiles/taylorhood.dir/build.make:62: recipe for target 'src/CMakeFiles/taylorhood.dir/taylorhood.cc.o' failed
make[2]: *** [src/CMakeFiles/taylorhood.dir/taylorhood.cc.o] Error 1
CMakeFiles/Makefile2:1289: recipe for target 'src/CMakeFiles/taylorhood.dir/all' failed
make[1]: *** [src/CMakeFiles/taylorhood.dir/all] Error 2
make: *** [all] Error 2
Makefile:160: recipe for target 'all' failed
--- Failed to build dune-multimesh ---
Terminating dunecontrol due to previous errors!
ERROR: Job failed: exit code 1
failed
debian:9 gcc-6-14 Test
src/CMakeFiles/benchmark.dir/build.make:62: recipe for target 'src/CMakeFiles/benchmark.dir/benchmark.cc.o' failed
make[2]: *** [src/CMakeFiles/benchmark.dir/benchmark.cc.o] Error 1
make[1]: *** [src/CMakeFiles/benchmark.dir/all] Error 2
CMakeFiles/Makefile2:1252: recipe for target 'src/CMakeFiles/benchmark.dir/all' failed
Makefile:160: recipe for target 'all' failed
make: *** [all] Error 2
--- Failed to build dune-multimesh ---
Terminating dunecontrol due to previous errors!
ERROR: Job failed: exit code 1